BDBM145276 US8952169, 55
SMILES CS(=O)(=O)NC(=O)c1ccc(OCC2C3CC4CC(C3)CC2C4)c(c1)C1CC1
InChI Key InChIKey=XXRRNFFJNMKKHJ-UHFFFAOYSA-N
Data  2 IC50
  Tab Delimited (TSV)   2D SDfile   Computed 3D by Vconf -m prep SDfile
Find this compound or compounds like it in BindingDB:
Activity Spreadsheet -- Enzyme Inhibition Constant Data from BindingDB
Found 2 hits for monomerid = 145276
TargetSodium channel protein type 9 subunit alpha(Homo sapiens (Human))
Xenon Pharmaceuticals
US Patent
LigandPNGBDBM145276(US8952169, 55)
Affinity DataIC50:  3.10nMT: 2°C. Assay description: Patch voltage clamp electrophysiology allows for the direct measurement and quantification of block of voltage-gated sodium channels (NaV's), and all...
In DepthDetails US Patent
TargetSodium channel protein type 9 subunit alpha(Homo sapiens (Human))
Xenon Pharmaceuticals
US Patent
LigandPNGBDBM145276(US8952169, 55)
Affinity DataIC50:  9nMpH: 7.4 T: 2°C. Assay description: Radioligand Binding Studies: Saturation experiments. A representative compound of formula (I) was tritiated. Three tritiums were incorporated in plac...
In DepthDetails US Patent