BDBM146126 US8957068, 161
SMILES CC(C)[C@H]1COC(=O)N1c1ccnc(N[C@@H](C)C2CC2)n1
InChI Key InChIKey=HOMZIEYVBDLNSW-CMPLNLGQSA-N
Data  1 IC50
  Tab Delimited (TSV)   2D SDfile   Computed 3D by Vconf -m prep SDfile
Find this compound or compounds like it in BindingDB:
Activity Spreadsheet -- Enzyme Inhibition Constant Data from BindingDB
Found 1 hit for monomerid = 146126
TargetIsocitrate dehydrogenase [NADP] cytoplasmic(Homo sapiens (Human))
Novartis
US Patent
LigandPNGBDBM146126(US8957068, 161)
Affinity DataIC50:  6.50E+3nMpH: 7.4 T: 2°C. Assay description: Mutant IDH1 R132H catalytic activity was monitored using the quantitative liquid chromatography/mass spectrometry (LC-MS) detection of 2-HG, a produc...
In DepthDetails US Patent