BDBM1489 N-{3-[cyclopropyl({4-hydroxy-2-oxo-2H,5H,6H,7H,8H,9H,10H-cycloocta[b]pyran-3-yl})methyl]phenyl}quinoline-2-sulfonamide::Sulfonamide-Substituted Cyclooctylpyranone deriv. 37c
SMILES Oc1c2CCCCCCc2oc(=O)c1C(C1CC1)c1cccc(NS(=O)(=O)c2ccc3ccccc3n2)c1
InChI Key InChIKey=IWFYGSGCRXKOFT-UHFFFAOYSA-N
Data  1 KI
  Tab Delimited (TSV)   2D SDfile   Computed 3D by Vconf -m prep SDfile
Find this compound or compounds like it in BindingDB:
Activity Spreadsheet -- Enzyme Inhibition Constant Data from BindingDB
Found 1 hit for monomerid = 1489
TargetDimer of Gag-Pol polyprotein [489-587](Human immunodeficiency virus type 1)
Upjohn
LigandPNGBDBM1489(N-{3-[cyclopropyl({4-hydroxy-2-oxo-2H,5H,6H,7H,8H,...)
Affinity DataKi:  0.400nM. Assay description: HIV-1 protease was purified and refolded from E. coli inclusion bodies. The substrate used spans the p17-p24 processing site (R-V-S-Q-N-Y-P-I-V-Q-N-K...
In DepthDetails ArticlePubMed