BDBM14904 2-[3-(3-bromo-5-chloro-2-hydroxyphenyl)-5-(5-carbamimidoyl-1H-1,3-benzodiazol-2-yl)-4-hydroxyphenyl]butanedioic acid::5-amidino benzimidazole analog 15
SMILES NC(=N)c1ccc2nc([nH]c2c1)-c1cc(cc(c1O)-c1cc(Cl)cc(Br)c1O)C(CC(O)=O)C(O)=O
InChI Key InChIKey=GRWCDFVTCGNROE-UHFFFAOYSA-N
Data  1 KI
  Tab Delimited (TSV)   2D SDfile   Computed 3D by Vconf -m prep SDfile
Find this compound or compounds like it in BindingDB:
Activity Spreadsheet -- Enzyme Inhibition Constant Data from BindingDB
Found 1 hit for monomerid = 14904
TargetCoagulation factor VII(Homo sapiens (Human))
Celera
LigandPNGBDBM14904(2-[3-(3-bromo-5-chloro-2-hydroxyphenyl)-5-(5-carba...)
Affinity DataKi:  9nM ΔG°:  -10.9kcal/molepH: 7.4 T: 2°C. Assay description: The enzyme reactions were initiated by the addition of substrate, and the color developed from the release of p-nitroanilide from each chromogenic su...
In DepthDetails ArticlePubMed