BDBM14918 2-[3-(5-carbamimidoyl-1H-1,3-benzodiazol-2-yl)-5-(3,5-difluorophenyl)-4-hydroxyphenyl]butanedioic acid::5-amidino benzimidazole analog 29
SMILES NC(=N)c1ccc2nc([nH]c2c1)-c1cc(cc(-c2cc(F)cc(F)c2)c1O)C(CC(O)=O)C(O)=O
InChI Key InChIKey=ZLNHFHLDTQEYRH-UHFFFAOYSA-N
Data  1 KI
  Tab Delimited (TSV)   2D SDfile   Computed 3D by Vconf -m prep SDfile
Find this compound or compounds like it in BindingDB:
Activity Spreadsheet -- Enzyme Inhibition Constant Data from BindingDB
Found 1 hit for monomerid = 14918
TargetCoagulation factor VII(Homo sapiens (Human))
Celera
LigandPNGBDBM14918(2-[3-(5-carbamimidoyl-1H-1,3-benzodiazol-2-yl)-5-(...)
Affinity DataKi:  68nM. Assay description: The enzyme reactions were initiated by the addition of substrate, and the color developed from the release of p-nitroanilide from each chromogenic su...
In DepthDetails ArticlePubMed