BDBM14941 2-[3-(5-carbamimidoyl-1H-1,3-benzodiazol-2-yl)-4-hydroxy-5-[2-(hydroxymethyl)phenyl]phenyl]butanedioic acid::5-amidino benzimidazole analog 52
SMILES NC(=N)c1ccc2nc([nH]c2c1)-c1cc(cc(c1O)-c1ccccc1CO)C(CC(O)=O)C(O)=O
InChI Key InChIKey=BUBSNNUJBMVCTO-UHFFFAOYSA-N
Data  1 KI
  Tab Delimited (TSV)   2D SDfile   Computed 3D by Vconf -m prep SDfile
Find this compound or compounds like it in BindingDB:
Activity Spreadsheet -- Enzyme Inhibition Constant Data from BindingDB
Found 1 hit for monomerid = 14941
TargetCoagulation factor VII(Homo sapiens (Human))
Celera
LigandPNGBDBM14941(2-[3-(5-carbamimidoyl-1H-1,3-benzodiazol-2-yl)-4-h...)
Affinity DataKi:  730nM. Assay description: The enzyme reactions were initiated by the addition of substrate, and the color developed from the release of p-nitroanilide from each chromogenic su...
In DepthDetails ArticlePubMed