BDBM149478 US8975261, I-46
SMILES Cc1nn(C)c(C)c1-c1cnc(C)nc1OC[C@H]1C[C@@H]1c1ccc2ccccc2n1
InChI Key InChIKey=RFAJNLQZNSOJPX-MOPGFXCFSA-N
Data  1 KI
  Tab Delimited (TSV)   2D SDfile   Computed 3D by Vconf -m prep SDfile
Find this compound or compounds like it in BindingDB:
Activity Spreadsheet -- Enzyme Inhibition Constant Data from BindingDB
Found 1 hit for monomerid = 149478
TargetcAMP and cAMP-inhibited cGMP 3',5'-cyclic phosphodiesterase 10A(Homo sapiens (Human))
Merck Sharp & Dohme
US Patent
LigandPNGBDBM149478(US8975261, I-46)
Affinity DataKi:  0.00200nM. Assay description: In a typical experiment the PDE10 inhibitory activity of the compounds of the present invention was determined in accordance with the following exper...
Ligand InfoPC cidPC sid
In DepthDetails US Patent