BDBM14972 4-Methyl-N-phenyl-3-(3-(pyrimidin-4-yl)pyridin-2-ylamino)-benzamide::4-methyl-N-phenyl-3-{[3-(pyrimidin-4-yl)pyridin-2-yl]amino}benzamide::pyridinyl pyrimidine 37
SMILES Cc1ccc(cc1Nc1ncccc1-c1ccncn1)C(=O)Nc1ccccc1
InChI Key InChIKey=QJPWLLXUZHFJGQ-UHFFFAOYSA-N
Data  2 IC50
  Tab Delimited (TSV)   2D SDfile   Computed 3D by Vconf -m prep SDfile
Find this compound or compounds like it in BindingDB:
Activity Spreadsheet -- Enzyme Inhibition Constant Data from BindingDB
Found 2 hits for monomerid = 14972
TargetVascular endothelial growth factor receptor 2(Homo sapiens (Human))
Amgen
LigandPNGBDBM14972(4-Methyl-N-phenyl-3-(3-(pyrimidin-4-yl)pyridin-2-y...)
Affinity DataIC50:  435nM. Assay description: The assay uses purified enzyme interacting with biotinylated peptide substrate. HTRF is based on the proximity of europium cryptate (donor fluorophor...
In DepthDetails ArticlePubMed
TargetAngiopoietin-1 receptor(Homo sapiens (Human))
Amgen
LigandPNGBDBM14972(4-Methyl-N-phenyl-3-(3-(pyrimidin-4-yl)pyridin-2-y...)
Affinity DataIC50:  1.22E+3nMpH: 7.5 T: 2°C. Assay description: The assay uses purified enzyme interacting with biotinylated peptide substrate. HTRF is based on the proximity of europium cryptate (donor fluorophor...
In DepthDetails ArticlePubMed