BDBM14993 2-(Methylamino)pyrimidine 56::2-methyl-3-({3-[2-(methylamino)pyrimidin-4-yl]pyridin-2-yl}oxy)-N-[2-(piperidin-1-yl)-5-(trifluoromethyl)phenyl]benzamide
SMILES CNc1nccc(n1)-c1cccnc1Oc1cccc(C(=O)Nc2cc(ccc2N2CCCCC2)C(F)(F)F)c1C
InChI Key InChIKey=PKGBEMFHRGEPMZ-UHFFFAOYSA-N
Data  2 IC50
  Tab Delimited (TSV)   2D SDfile   Computed 3D by Vconf -m prep SDfile
Find this compound or compounds like it in BindingDB:
Activity Spreadsheet -- Enzyme Inhibition Constant Data from BindingDB
Found 2 hits for monomerid = 14993
TargetVascular endothelial growth factor receptor 2(Homo sapiens (Human))
Amgen
LigandPNGBDBM14993(2-(Methylamino)pyrimidine 56 | 2-methyl-3-({3-[2-(...)
Affinity DataIC50:  2.60E+3nM. Assay description: The assay uses purified enzyme interacting with biotinylated peptide substrate. HTRF is based on the proximity of europium cryptate (donor fluorophor...
In DepthDetails ArticlePubMed
TargetAngiopoietin-1 receptor(Homo sapiens (Human))
Amgen
LigandPNGBDBM14993(2-(Methylamino)pyrimidine 56 | 2-methyl-3-({3-[2-(...)
Affinity DataIC50:  388nM. Assay description: The assay uses purified enzyme interacting with biotinylated peptide substrate. HTRF is based on the proximity of europium cryptate (donor fluorophor...
In DepthDetails ArticlePubMed