BDBM14999 2-(Methylamino)triazine 62::2-Fluoro-5-(3-(4-(methylamino)-1,3,5-triazin-2-yl)pyridin-2-yloxy)-N-(2-(piperidin-1-yl)-5-(trifluoromethyl)phenyl)benzamide::2-fluoro-5-({3-[4-(methylamino)-1,3,5-triazin-2-yl]pyridin-2-yl}oxy)-N-[2-(piperidin-1-yl)-5-(trifluoromethyl)phenyl]benzamide
SMILES CNc1ncnc(n1)-c1cccnc1Oc1ccc(F)c(c1)C(=O)Nc1cc(ccc1N1CCCCC1)C(F)(F)F
InChI Key InChIKey=QWGLBOWQKIXGQN-UHFFFAOYSA-N
Data  2 IC50
  Tab Delimited (TSV)   2D SDfile   Computed 3D by Vconf -m prep SDfile
Find this compound or compounds like it in BindingDB:
Activity Spreadsheet -- Enzyme Inhibition Constant Data from BindingDB
Found 2 hits for monomerid = 14999
TargetVascular endothelial growth factor receptor 2(Homo sapiens (Human))
Amgen
LigandPNGBDBM14999(2-(Methylamino)triazine 62 | 2-Fluoro-5-(3-(4-(met...)
Affinity DataIC50: >2.50E+4nM. Assay description: The assay uses purified enzyme interacting with biotinylated peptide substrate. HTRF is based on the proximity of europium cryptate (donor fluorophor...
In DepthDetails ArticlePubMed
TargetAngiopoietin-1 receptor(Homo sapiens (Human))
Amgen
LigandPNGBDBM14999(2-(Methylamino)triazine 62 | 2-Fluoro-5-(3-(4-(met...)
Affinity DataIC50:  53nM. Assay description: The assay uses purified enzyme interacting with biotinylated peptide substrate. HTRF is based on the proximity of europium cryptate (donor fluorophor...
In DepthDetails ArticlePubMed