BDBM15000 2-(Methylamino)triazine 63::N-(2-((3-(Dimethylamino)propyl)(methyl)amino)-5-(trifluoromethyl)phenyl)-2-fluoro-5-(3-(4-(methylamino)-1,3,5-triazin-2-yl)pyridin-2-yloxy)benzamide::N-(2-{[3-(dimethylamino)propyl](methyl)amino}-5-(trifluoromethyl)phenyl)-2-fluoro-5-({3-[4-(methylamino)-1,3,5-triazin-2-yl]pyridin-2-yl}oxy)benzamide
SMILES CNc1ncnc(n1)-c1cccnc1Oc1ccc(F)c(c1)C(=O)Nc1cc(ccc1N(C)CCCN(C)C)C(F)(F)F
InChI Key InChIKey=HHKGVQGXRGQBBA-UHFFFAOYSA-N
Data  2 IC50
  Tab Delimited (TSV)   2D SDfile   Computed 3D by Vconf -m prep SDfile
Find this compound or compounds like it in BindingDB:
Activity Spreadsheet -- Enzyme Inhibition Constant Data from BindingDB
Found 2 hits for monomerid = 15000
TargetVascular endothelial growth factor receptor 2(Homo sapiens (Human))
Amgen
LigandPNGBDBM15000(2-(Methylamino)triazine 63 | N-(2-((3-(Dimethylami...)
Affinity DataIC50:  7.80E+3nM. Assay description: The assay uses purified enzyme interacting with biotinylated peptide substrate. HTRF is based on the proximity of europium cryptate (donor fluorophor...
In DepthDetails ArticlePubMed
TargetAngiopoietin-1 receptor(Homo sapiens (Human))
Amgen
LigandPNGBDBM15000(2-(Methylamino)triazine 63 | N-(2-((3-(Dimethylami...)
Affinity DataIC50:  30nM. Assay description: The assay uses purified enzyme interacting with biotinylated peptide substrate. HTRF is based on the proximity of europium cryptate (donor fluorophor...
In DepthDetails ArticlePubMed