BDBM152902 US8993586, 90
SMILES COc1cc2ccc(cc2cn1)C(=O)N1CCC2(CC1)Cc1cn(nc1C(=O)N2)C(C)(C)C
InChI Key InChIKey=SVXJZFIFIKXJIQ-UHFFFAOYSA-N
Data  2 IC50
  Tab Delimited (TSV)   2D SDfile   Computed 3D by Vconf -m prep SDfile
Find this compound or compounds like it in BindingDB:
Activity Spreadsheet -- Enzyme Inhibition Constant Data from BindingDB
Found 2 hits for monomerid = 152902
TargetAcetyl-CoA carboxylase 2(Homo sapiens (Human))
Pfizer
US Patent
LigandPNGBDBM152902(US8993586, 90)
Affinity DataIC50:  31nM. Assay description: Preparation of rhACC2. Human ACC2 inhibition was measured using purified recombinant human ACC2 (hrACC2). Briefly, a full length Cytomax clone of ACC...
In DepthDetails US Patent
TargetAcetyl-CoA carboxylase 1(Homo sapiens (Human))
Pfizer
US Patent
LigandPNGBDBM152902(US8993586, 90)
Affinity DataIC50:  209nMpH: 7.5Assay Description:Preparation of rhACC1. Two liters of SF9 cells, infected with recombinant baculovirus containing full length human ACC1 cDNA, were suspended in ice-c...
In DepthDetails US Patent