BDBM155095 US10118915, Compound 13::US9682966, 13
SMILES COC(=O)c1cc(Br)cnc1N1CCC(CC1)NC1CCOCC1
InChI Key InChIKey=AEJRXZAXGRDVEN-UHFFFAOYSA-N
Data  2 IC50
  Tab Delimited (TSV)   2D SDfile   Computed 3D by Vconf -m prep SDfile
Find this compound or compounds like it in BindingDB:
Activity Spreadsheet -- Enzyme Inhibition Constant Data from BindingDB
Found 2 hits for monomerid = 155095
TargetKappa-type opioid receptor(Homo sapiens (Human))
The Scripps Research Institute
US Patent
LigandPNGBDBM155095(US10118915, Compound 13 | US9682966, 13)
Affinity DataIC50:  621nM. Assay description: Well-known assay for kappa opioid receptor
Ligand InfoPC cidPC sid
In DepthDetails US Patent
TargetKappa-type opioid receptor(Homo sapiens (Human))
The Scripps Research Institute
US Patent
LigandPNGBDBM155095(US10118915, Compound 13 | US9682966, 13)
Affinity DataIC50:  621nMT: 2°C. Assay description: The cell line for the OPRK1 antagonist assay stably expresses the following elements. The carboxy terminus of the OPRK1 receptor has a 7 amino acid l...
Ligand InfoPC cidPC sid
In DepthDetails US Patent