BDBM155118 US9000183, 4
SMILES COC1CCC2(Cc3cc(F)c(Br)cc3C22N=C(C)C(N)=N2)CC1
InChI Key InChIKey=WSDJYMPBPPNFDL-UHFFFAOYSA-N
Data  2 IC50
  Tab Delimited (TSV)   2D SDfile   Computed 3D by Vconf -m prep SDfile
Find this compound or compounds like it in BindingDB:
Activity Spreadsheet -- Enzyme Inhibition Constant Data from BindingDB
Found 2 hits for monomerid = 155118
TargetAmyloid-beta precursor protein(Homo sapiens (Human))
Astrazeneca
US Patent
LigandPNGBDBM155118(US9000183, 4)
Affinity DataIC50:  176nMT: 2°C. Assay description: SH-SY5Y cells were cultured in DMEM/F-12 with Glutamax, 10% FCS and 1% non-essential amino acids and cryopreserved and stored at -140 C. at a concent...
Ligand InfoPC cidPC sid
In DepthDetails US Patent
TargetBeta-secretase 1(Homo sapiens (Human))
Astrazeneca
US Patent
LigandPNGBDBM155118(US9000183, 4)
Affinity DataIC50:  516nMpH: 2.5Assay Description:The beta -secretase enzyme used in the TR-FRET is prepared as follows:The cDNA for the soluble part of the human beta -Secretase (AA 1-AA 460) was cl...
Ligand InfoPC cidPC sid
In DepthDetails US Patent