BDBM159198 US9034866, 675
SMILES Cc1cc(no1)[C@](C)(O)C#Cc1ccc2OCCc3cc(nn3-c2c1)C(N)=O
InChI Key InChIKey=KMFXYYBVRWQPMV-HXUWFJFHSA-N
Data  1 KI
  Tab Delimited (TSV)   2D SDfile   Computed 3D by Vconf -m prep SDfile
Find this compound or compounds like it in BindingDB:
Activity Spreadsheet -- Enzyme Inhibition Constant Data from BindingDB
Found 1 hit for monomerid = 159198
TargetMitogen-activated protein kinase kinase kinase 14(Homo sapiens (Human))
Genentech
US Patent
LigandPNGBDBM159198(US9034866, 675)
Affinity DataKi:  6.60nMpH: 7.2Assay Description:The ability of the nuclear factor-kappa B (NF-kB)-inducing kinase (NIK) to catalyze the hydrolysis of adenosine-5'-triphosphate (ATP) was monitored u...
In DepthDetails US Patent