BDBM160171 US9040663, 17
SMILES CC(=O)N[C@@H](CCCNC(N)=N)C(=O)N[C@H]1CCC(=O)NCCC[C@H](NC(=O)[C@H](Cc2c[nH]c3ccccc23)NC(=O)[C@H](CCCNC(N)=N)NC(=O)[C@@H](Cc2cc(F)cc(F)c2)NC(=O)[C@H](CCN)NC1=O)C(N)=O
InChI Key
Data  1 KI
  Tab Delimited (TSV)   2D SDfile   Computed 3D by Vconf -m prep SDfile
Find this compound or compounds like it in BindingDB:
Activity Spreadsheet -- Enzyme Inhibition Constant Data from BindingDB
Found 1 hit for monomerid = 160171
TargetMelanocortin receptor 4(Homo sapiens (Human))
Astrazeneca
US Patent
LigandPNGBDBM160171(US9040663, 17)
Affinity DataKi:  2nM ΔG°:  -12.3kcal/molepH: 7.5 T: 2°C. Assay description: A competitive inhibition binding assay was performed for exemplified peptides according to the invention using membrane homogenates prepared from HEK...
In DepthDetails US Patent