BDBM160923 US11014909, Example 12::US9107923, 12
SMILES CCn1c(c(C)c(=O)[nH]c1=O)-c1ccc(Oc2ncccc2C(F)F)cc1C
InChI Key InChIKey=AQJVLUHOWZSSPW-UHFFFAOYSA-N
Data  2 KI
  Tab Delimited (TSV)   2D SDfile   Computed 3D by Vconf -m prep SDfile
Find this compound or compounds like it in BindingDB:
Activity Spreadsheet -- Enzyme Inhibition Constant Data from BindingDB
Found 2 hits for monomerid = 160923
TargetD(1A) dopamine receptor(Homo sapiens (Human))
Pfizer
US Patent
LigandPNGBDBM160923(US11014909, Example 12 | US9107923, 12)
Affinity DataKi:  55.1nM. Assay description: D1 binding assays were performed using over-expressing LTK human cell lines. To determine basic assay parameters, ligand concentrations were determin...
In DepthDetails US Patent
TargetD(1A) dopamine receptor(Homo sapiens (Human))
Pfizer
US Patent
LigandPNGBDBM160923(US11014909, Example 12 | US9107923, 12)
Affinity DataKi:  55.1nM. Assay description: The affinity of the compounds described herein was determined by competition binding assays similar to those described in Ryman-Rasmussen et al., Dif...
In DepthDetails US Patent