BDBM161919 US10017516, Compound 51::US9682983, 51
SMILES CN1CCN(CCOc2ccc(nc2)-c2cnc3c(cnn3c2)-c2cccc3ncccc23)CC1
InChI Key InChIKey=LCNMZQCSKWYNQF-UHFFFAOYSA-N
Data  8 IC50
  Tab Delimited (TSV)   2D SDfile   Computed 3D by Vconf -m prep SDfile
Find this compound or compounds like it in BindingDB:
Activity Spreadsheet -- Enzyme Inhibition Constant Data from BindingDB
Found 8 hits for monomerid = 161919
TargetSerine/threonine-protein kinase receptor R3(Homo sapiens (Human))
The Brigham And Women'S Hospital
US Patent
LigandPNGBDBM161919(US10017516, Compound 51 | US9682983, 51)
Affinity DataIC50:  349nMpH: 7.5Assay Description:Specifically, compounds were assayed using LANCE® Ultra ULight¿ technology (Perkin Elmer) against human ALK1-6 enzymes (ALK1: Life Technologies, ALK2...
Ligand InfoPC cidPC sid
In DepthDetails US Patent
TargetActivin receptor type-1(Homo sapiens (Human))
The Brigham And Women'S Hospital
US Patent
LigandPNGBDBM161919(US10017516, Compound 51 | US9682983, 51)
Affinity DataIC50:  151nMpH: 7.5Assay Description:Specifically, compounds were assayed using LANCE® Ultra ULight¿ technology (Perkin Elmer) against human ALK1-6 enzymes (ALK1: Life Technologies, ALK2...
Ligand InfoPC cidPC sid
In DepthDetails US Patent
TargetBone morphogenetic protein receptor type-1A(Homo sapiens (Human))
The Brigham And Women'S Hospital
US Patent
LigandPNGBDBM161919(US10017516, Compound 51 | US9682983, 51)
Affinity DataIC50:  2.99E+3nMpH: 7.5Assay Description:Specifically, compounds were assayed using LANCE® Ultra ULight¿ technology (Perkin Elmer) against human ALK1-6 enzymes (ALK1: Life Technologies, ALK2...
Ligand InfoPC cidPC sid
In DepthDetails US Patent
TargetBone morphogenetic protein receptor type-1B(Homo sapiens (Human))
The Brigham And Women'S Hospital
US Patent
LigandPNGBDBM161919(US10017516, Compound 51 | US9682983, 51)
Affinity DataIC50:  7.57E+3nM. Assay description: Compounds were assessed in ALK1-6 enzymatic assays. Specifically, compounds were assayed using LANCE® Ultra ULight technology (Perkin Elmer) against ...
Ligand InfoPC cidPC sid
In DepthDetails US Patent
TargetSerine/threonine-protein kinase receptor R3(Homo sapiens (Human))
The Brigham And Women'S Hospital
US Patent
LigandPNGBDBM161919(US10017516, Compound 51 | US9682983, 51)
Affinity DataIC50:  349nM. Assay description: Compounds were assessed in ALK1-6 enzymatic assays. Specifically, compounds were assayed using LANCE® Ultra ULight technology (Perkin Elmer) against ...
Ligand InfoPC cidPC sid
In DepthDetails US Patent
TargetActivin receptor type-1(Homo sapiens (Human))
The Brigham And Women'S Hospital
US Patent
LigandPNGBDBM161919(US10017516, Compound 51 | US9682983, 51)
Affinity DataIC50:  151nM. Assay description: Compounds were assessed in ALK1-6 enzymatic assays. Specifically, compounds were assayed using LANCE® Ultra ULight technology (Perkin Elmer) against ...
Ligand InfoPC cidPC sid
In DepthDetails US Patent
TargetBone morphogenetic protein receptor type-1A(Homo sapiens (Human))
The Brigham And Women'S Hospital
US Patent
LigandPNGBDBM161919(US10017516, Compound 51 | US9682983, 51)
Affinity DataIC50:  2.99E+3nM. Assay description: Compounds were assessed in ALK1-6 enzymatic assays. Specifically, compounds were assayed using LANCE® Ultra ULight technology (Perkin Elmer) against ...
Ligand InfoPC cidPC sid
In DepthDetails US Patent
TargetBone morphogenetic protein receptor type-1B(Homo sapiens (Human))
The Brigham And Women'S Hospital
US Patent
LigandPNGBDBM161919(US10017516, Compound 51 | US9682983, 51)
Affinity DataIC50:  7.57E+3nMpH: 7.5Assay Description:Specifically, compounds were assayed using LANCE® Ultra ULight¿ technology (Perkin Elmer) against human ALK1-6 enzymes (ALK1: Life Technologies, ALK2...
Ligand InfoPC cidPC sid
In DepthDetails US Patent