BDBM1639 2-ethyl-12-methyl-2,4,10-triazatricyclo[9.4.0.0^{3,8}]pentadeca-1(11),3(8),4,6,12,14-hexaen-9-one::6,ll-Dihydro-1 l-ethyl-7-methyl-5H-pyrido[2,3-b][ 1,5]-benzodiazepin-5-one::Pyridobenzodiazepinone deriv. 33
SMILES CCN1c2cccc(C)c2NC(=O)c2cccnc12
InChI Key InChIKey=GSLBQKHXBYDHEM-UHFFFAOYSA-N
Data  1 IC50
  Tab Delimited (TSV)   2D SDfile   Computed 3D by Vconf -m prep SDfile
Find this compound or compounds like it in BindingDB:
Activity Spreadsheet -- Enzyme Inhibition Constant Data from BindingDB
Found 1 hit for monomerid = 1639
TargetGag-Pol polyprotein [600-1027,R876K]/[600-1155](Human immunodeficiency virus type 1)
Boehringer Ingelheim Pharmaceuticals
LigandPNGBDBM1639(2-ethyl-12-methyl-2,4,10-triazatricyclo[9.4.0.0^{3...)
Affinity DataIC50:  38nMpH: 7.8 T: 2°C. Assay description: The IC50 of reverse transcriptase is the concentration that inhibits 50% of recombinant HIV-1 RT RNA-directed DNA polymerase activity in vitro.
In DepthDetails ArticlePubMed