BDBM164467 US9066954, 282
SMILES COc1ccc2c(OCc3nnc4ccc(cn34)-c3ccccn3)ccnc2c1
InChI Key InChIKey=IBVFTTBMTRFGDQ-UHFFFAOYSA-N
Data  1 KI
  Tab Delimited (TSV)   2D SDfile   Computed 3D by Vconf -m prep SDfile
Find this compound or compounds like it in BindingDB:
Activity Spreadsheet -- Enzyme Inhibition Constant Data from BindingDB
Found 1 hit for monomerid = 164467
TargetHepatocyte growth factor receptor(Homo sapiens (Human))
Amgen
US Patent
LigandPNGBDBM164467(US9066954, 282)
Affinity DataKi:  9.5nM ΔG°:  -11.0kcal/molepH: 8.0 T: 2°C. Assay description: A PCR product covering residues 1058-1365 of c-Met (c-Met kinase domain) is generated from Human Liver QuickClone cDNA (Invitrogen) using forward pri...
In DepthDetails US Patent