BDBM164874 US10604504, Example 22::US11623921, Example 22::US9688629, 22::US9920031, Example 22
SMILES Cc1[nH]c2c(ccc(-c3cccc(NC(=O)C=C)c3)c2c1C)C(N)=O
InChI Key InChIKey=WLOCKZOWFWGHHL-UHFFFAOYSA-N
Data  6 IC50
  Tab Delimited (TSV)   2D SDfile   Computed 3D by Vconf -m prep SDfile
Find this compound or compounds like it in BindingDB:
Activity Spreadsheet -- Enzyme Inhibition Constant Data from BindingDB
Found 6 hits for monomerid = 164874
TargetTyrosine-protein kinase BTK(Homo sapiens (Human))
Bristol-Myers Squibb
US Patent
LigandPNGBDBM164874(US10604504, Example 22 | US11623921, Example 22 | ...)
Affinity DataIC50:  0.210nMpH: 7.4 T: 2°C. Assay description: To V-bottom 384-well plates were added test compounds, human recombinant Btk (1 nM, Invitrogen Corporation), fluoresceinated peptide (1.5 μM), A...
Ligand InfoPC cidPC sid
In DepthDetails US Patent
TargetTyrosine-protein kinase BTK(Homo sapiens (Human))
Bristol-Myers Squibb
US Patent
LigandPNGBDBM164874(US10604504, Example 22 | US11623921, Example 22 | ...)
Affinity DataIC50:  0.210nM. Assay description: To V-bottom 384-well plates were added test compounds, human recombinant Btk (1 nM, Invitrogen Corporation), fluoresceinated peptide (1.5 μM), A...
Ligand InfoPC cidPC sid
In DepthDetails US Patent
TargetTyrosine-protein kinase BTK(Homo sapiens (Human))
Bristol-Myers Squibb
US Patent
LigandPNGBDBM164874(US10604504, Example 22 | US11623921, Example 22 | ...)
Affinity DataIC50:  0.210nM. Assay description: To V-bottom 384-well plates were added test compounds, human recombinant Btk (1 nM, Invitrogen Corporation), fluoresceinated peptide (1.5 μM), A...
Ligand InfoPC cidPC sid
In DepthDetails US Patent
TargetTyrosine-protein kinase BTK(Homo sapiens (Human))
Bristol-Myers Squibb
US Patent
LigandPNGBDBM164874(US10604504, Example 22 | US11623921, Example 22 | ...)
Affinity DataIC50:  16nM. Assay description: Inhibition of BTK in human Ramos cells assessed as reduction in intracellular calcium level incubated for 1 hr measured for 180 secs by FLIPR assay
Ligand InfoPC cidPC sid
In DepthDetails ArticlePubMed
TargetTyrosine-protein kinase BTK(Homo sapiens (Human))
Bristol-Myers Squibb
US Patent
LigandPNGBDBM164874(US10604504, Example 22 | US11623921, Example 22 | ...)
Affinity DataIC50:  0.210nM. Assay description: To V-bottom 384-well plates were added test compounds, human recombinant Btk (1 nM, Invitrogen Corporation), fluoresceinated peptide (1.5 μM), A...
Ligand InfoPC cidPC sid
In DepthDetails US Patent
TargetTyrosine-protein kinase BTK(Homo sapiens (Human))
Bristol-Myers Squibb
US Patent
LigandPNGBDBM164874(US10604504, Example 22 | US11623921, Example 22 | ...)
Affinity DataIC50:  0.210nM. Assay description: Inhibition of recombinant human full-length His-tagged BTK cytoplasmic domain expressed in baculovirus expression system using fluorescence-labelled ...
Ligand InfoPC cidPC sid
In DepthDetails ArticlePubMed