BDBM166688 2-Amino-2-(aminomethyl)-6-(1-carboxy-4-(2-nitroguanidino)butylamino)-6-oxohexanoic acid (L5)
SMILES NCC(N)(CCCC(=O)NC(CCCNC(N)=N[N+]([O-])=O)C(O)=O)C(O)=O
InChI Key InChIKey=IKBMOJMKHABFII-UHFFFAOYSA-N
Data  1 KI
  Tab Delimited (TSV)   2D SDfile   Computed 3D by Vconf -m prep SDfile
Find this compound or compounds like it in BindingDB:
Activity Spreadsheet -- Enzyme Inhibition Constant Data from BindingDB
Found 1 hit for monomerid = 166688
TargetNitric oxide synthase, inducible(Mus musculus (mouse))
Universidade De Lisboa
LigandPNGBDBM166688(2-Amino-2-(aminomethyl)-6-(1-carboxy-4-(2-nitrogua...)
Affinity DataKi:  6.20E+3nM. Assay description: The iNOS activity assay was based on the method of hemoglobin assay previously described with slight modifications. The activity of the enzyme was de...
In DepthDetails ArticlePubMed