BDBM16699 1-N-[(2S)-1-{[(1S)-1-(benzylcarbamoyl)ethyl]amino}-3-phenylpropan-2-yl]-3-N-[(1R)-1-(4-fluorophenyl)ethyl]-5-(N-methylmethanesulfonamido)benzene-1,3-dicarboxamide::psi[CH2NH] reduced amide isostere, 4i
SMILES C[C@H](NC[C@H](Cc1ccccc1)NC(=O)c1cc(cc(c1)C(=O)N[C@H](C)c1ccc(F)cc1)N(C)S(C)(=O)=O)C(=O)NCc1ccccc1
InChI Key InChIKey=LJFISZVCRAOHJW-GJCZEXATSA-N
Data  1 IC50
  Tab Delimited (TSV)   2D SDfile   Computed 3D by Vconf -m prep SDfile
Find this compound or compounds like it in BindingDB:
Activity Spreadsheet -- Enzyme Inhibition Constant Data from BindingDB
Found 1 hit for monomerid = 16699
TargetBeta-secretase 1(Homo sapiens (Human))
Merck Research Laboratories
LigandPNGBDBM16699(1-N-[(2S)-1-{[(1S)-1-(benzylcarbamoyl)ethyl]amino}...)
Affinity DataIC50:  139nMpH: 4.5 T: 2°C. Assay description: The assay was performed using a 96-well format on a HPLC equipped with four 96-well plate holders. Test compounds were preincubated with enzymes for ...
In DepthDetails ArticlePubMed