BDBM167507 US9073917, 4- comparative
SMILES CCc1[nH]cc2C(C3=C(CCCC3=O)Nc12)c1cccc(Sc2nc3ccccc3[nH]2)c1
InChI Key
Data  2 IC50
  Tab Delimited (TSV)   2D SDfile   Computed 3D by Vconf -m prep SDfile
Find this compound or compounds like it in BindingDB:
Activity Spreadsheet -- Enzyme Inhibition Constant Data from BindingDB
Found 2 hits for monomerid = 167507
TargetAurora kinase A(Homo sapiens (Human))
Sanofi
US Patent
LigandPNGBDBM167507(US9073917, 4- comparative)
Affinity DataIC50:  72nM. Assay description: The capacity to inhibit the kinase activity of the enzyme is estimated by measuring the residual kinase activity of the enzyme in the presence of dif...
In DepthDetails US Patent
TargetAurora kinase B/Inner centromere protein(Homo sapiens (Human))
Sanofi
US Patent
LigandPNGBDBM167507(US9073917, 4- comparative)
Affinity DataIC50:  6nM. Assay description: The capacity to inhibit the kinase activity of the enzyme is estimated by measuring the residual kinase activity of the enzyme in the presence of dif...
In DepthDetails US Patent