BDBM16759 6-[(2R,4S,5S)-6-(3,5-difluorophenyl)-5-{[3-(dipropylcarbamoyl)phenyl]formamido}-2-ethyl-4-hydroxyhexanamido]hexanoic acid::Hydroxyethylene-Based Peptidomimetic Inhibitor, 9
SMILES CCCN(CCC)C(=O)c1cccc(c1)C(=O)N[C@@H](Cc1cc(F)cc(F)c1)[C@@H](O)C[C@@H](CC)C(=O)NCCCCCC(O)=O
InChI Key InChIKey=VGCDJFXZQIRXCZ-FRDKBHKLSA-N
Data  1 IC50
  Tab Delimited (TSV)   2D SDfile   Computed 3D by Vconf -m prep SDfile
Find this compound or compounds like it in BindingDB:
Activity Spreadsheet -- Enzyme Inhibition Constant Data from BindingDB
Found 1 hit for monomerid = 16759
TargetBeta-secretase 1(Homo sapiens (Human))
Elan Pharmaceuticals
LigandPNGBDBM16759(6-[(2R,4S,5S)-6-(3,5-difluorophenyl)-5-{[3-(diprop...)
Affinity DataIC50:  240nMpH: 4.8 T: 2°C. Assay description: Beta-cleavage ELISA assays were carried out in reaction buffer containing enzyme, substrate MBP-C125, and test compounds. Generated beta-cleaved prod...
In DepthDetails ArticlePubMed