BDBM16768 4-{[(2R,4S,5S)-6-(3,5-difluorophenyl)-5-{[3-(dipropylcarbamoyl)phenyl]formamido}-4-hydroxy-2-(2-methylpropyl)hexanamido]methyl}cyclohexane-1-carboxylic acid::Hydroxyethylene-Based Peptidomimetic Inhibitor, 18
SMILES CCCN(CCC)C(=O)c1cccc(c1)C(=O)N[C@@H](Cc1cc(F)cc(F)c1)[C@@H](O)C[C@@H](CC(C)C)C(=O)NC[C@H]1CC[C@@H](CC1)C(O)=O
InChI Key InChIKey=LAFQDXVUSUGFRL-GFMLWFCCSA-N
Data  1 IC50
  Tab Delimited (TSV)   2D SDfile   Computed 3D by Vconf -m prep SDfile
Find this compound or compounds like it in BindingDB:
Activity Spreadsheet -- Enzyme Inhibition Constant Data from BindingDB
Found 1 hit for monomerid = 16768
TargetBeta-secretase 1(Homo sapiens (Human))
Elan Pharmaceuticals
LigandPNGBDBM16768(4-{[(2R,4S,5S)-6-(3,5-difluorophenyl)-5-{[3-(dipro...)
Affinity DataIC50:  310nMpH: 4.8 T: 2°C. Assay description: Beta-cleavage ELISA assays were carried out in reaction buffer containing enzyme, substrate MBP-C125, and test compounds. Generated beta-cleaved prod...
In DepthDetails ArticlePubMed