BDBM168106 US9073931, E20a
SMILES CC(C)[C@H]1N(CCn2c1nc1cc(CO)c(cc21)S(C)(=O)=O)c1ncc(CO)c(n1)C1CC1
InChI Key InChIKey=OSNFDPBMTJXLGE-OAQYLSRUSA-N
Data  2 KI
  Tab Delimited (TSV)   2D SDfile   Computed 3D by Vconf -m prep SDfile
Find this compound or compounds like it in BindingDB:
Activity Spreadsheet -- Enzyme Inhibition Constant Data from BindingDB
Found 2 hits for monomerid = 168106
TargetOxysterols receptor LXR-beta(Homo sapiens (Human))
Vitae Pharmaceuticals
US Patent
LigandPNGBDBM168106(US9073931, E20a)
Affinity DataKi:  110nM ΔG°:  -9.49kcal/moleT: 2°C. Assay description: Compounds of the invention were assessed in a competition binding assay where different concentrations of compounds were incubated with the LXR ligan...
In DepthDetails US Patent
TargetOxysterols receptor LXR-alpha(Homo sapiens (Human))
Vitae Pharmaceuticals
US Patent
LigandPNGBDBM168106(US9073931, E20a)
Affinity DataKi:  1.76E+3nM ΔG°:  -7.84kcal/moleT: 2°C. Assay description: Compounds of the invention were assessed in a competition binding assay where different concentrations of compounds were incubated with the LXR ligan...
In DepthDetails US Patent