BDBM16827 (2S)-3-[4-(5-methoxy-2-methyl-3-oxo-2,3-dihydropyridazin-4-yl)phenyl]-2-[(methoxycarbonyl)amino]propanoic acid::pyridazinone-based antagonist, 33
SMILES COC(=O)N[C@@H](Cc1ccc(cc1)-c1c(OC)cnn(C)c1=O)C(O)=O
InChI Key InChIKey=CWYRXMARIDXJHG-LBPRGKRZSA-N
Data  2 IC50
  Tab Delimited (TSV)   2D SDfile   Computed 3D by Vconf -m prep SDfile
Find this compound or compounds like it in BindingDB:
Activity Spreadsheet -- Enzyme Inhibition Constant Data from BindingDB
Found 2 hits for monomerid = 16827
TargetIntegrin alpha-4/beta-7(Homo sapiens (Human))
Johnson & Johnson Pharmaceutical
LigandPNGBDBM16827((2S)-3-[4-(5-methoxy-2-methyl-3-oxo-2,3-dihydropyr...)
Affinity DataIC50:  710nMT: 2°C. Assay description: M2 anti-FLAG antibody coated 96-well plates were coated with recombinant FLAG-hMAdCAM-1 contained in Dulbecco PBS. The compounds to be tested were ad...
In DepthDetails ArticlePubMed
TargetIntegrin alpha-4/beta-1 [T112H](Homo sapiens (Human))
Johnson & Johnson Pharmaceutical
LigandPNGBDBM16827((2S)-3-[4-(5-methoxy-2-methyl-3-oxo-2,3-dihydropyr...)
Affinity DataIC50: >5.00E+3nMpH: 7.4 T: 2°C. Assay description:  Immulon 96-well plates were coated with recombinant hVCAM-1 overnight at 4 C. Plates were washed and blocked for 1 h at room temperature in PBS-BSA....
In DepthDetails ArticlePubMed