BDBM16835 (2S)-2-{[(3S)-2-(4-cyclohexylbutanoyl)-2-azabicyclo[2.2.2]octan-3-yl]formamido}-3-{4-[(3,5-dichloropyridine-4-)amido]phenyl}propanoic acid::azabicyclo[2.2.2]octane derivative, 20
SMILES OC(=O)[C@H](Cc1ccc(NC(=O)c2c(Cl)cncc2Cl)cc1)NC(=O)[C@@H]1C2CCC(CC2)N1C(=O)CCCC1CCCCC1
InChI Key InChIKey=FJLCDAKHIPSSNP-CHQSELIVSA-N
Data  2 IC50
  Tab Delimited (TSV)   2D SDfile   Computed 3D by Vconf -m prep SDfile
Find this compound or compounds like it in BindingDB:
Activity Spreadsheet -- Enzyme Inhibition Constant Data from BindingDB
Found 2 hits for monomerid = 16835
TargetIntegrin alpha-4/beta-7(Homo sapiens (Human))
Johnson & Johnson Pharmaceutical
LigandPNGBDBM16835((2S)-2-{[(3S)-2-(4-cyclohexylbutanoyl)-2-azabicycl...)
Affinity DataIC50:  250nMT: 2°C. Assay description: M2 anti-FLAG antibody coated 96-well plates were coated with recombinant FLAG-hMAdCAM-1 contained in Dulbecco PBS. The compounds to be tested were ad...
In DepthDetails ArticlePubMed
TargetIntegrin alpha-4/beta-1 [T112H](Homo sapiens (Human))
Johnson & Johnson Pharmaceutical
LigandPNGBDBM16835((2S)-2-{[(3S)-2-(4-cyclohexylbutanoyl)-2-azabicycl...)
Affinity DataIC50:  41nMpH: 7.4 T: 2°C. Assay description:  Immulon 96-well plates were coated with recombinant hVCAM-1 overnight at 4 C. Plates were washed and blocked for 1 h at room temperature in PBS-BSA....
In DepthDetails ArticlePubMed