BDBM168449 US9669034, 48 (rac)-[(3-{[4-(4-fluoro-2-methoxyphenyl)-1,3,5-triazin-2-yl]amino}benzyl)(methyl)oxido-λ6-sulfanylidene]cyanamide::US9669034, 49 [(3-{[4-(4-fluoro-2-methoxyphenyl)-1,3,5-triazin-2-yl]amino}benzyl)(methyl)oxido-λ6-sulfanylidene]cyanamide;enantiomer1::US9669034, 50 [(3-{[4-(4-fluoro-2-methoxyphenyl)-1,3,5-triazin-2-yl]amino}benzyl)(methyl)oxido-λ6-sulfanylidene]cyanamide;enantiomer2
SMILES COc1cc(F)ccc1-c1ncnc(Nc2cccc(CS(C)(=O)=NC#N)c2)n1
InChI Key InChIKey=HZWBTTMSSDOWKE-UHFFFAOYSA-N
Data  6 IC50
  Tab Delimited (TSV)   2D SDfile   Computed 3D by Vconf -m prep SDfile
Find this compound or compounds like it in BindingDB:
Activity Spreadsheet -- Enzyme Inhibition Constant Data from BindingDB
Found 6 hits for monomerid = 168449
TargetCyclin-T1/Cyclin-dependent kinase 9(Homo sapiens (Human))
Bayer Intellectual Property
US Patent
LigandPNGBDBM168449(US9669034, 48 (rac)-[(3-{[4-(4-fluoro-2-methoxyphe...)
Affinity DataIC50:  13nMpH: 8.0 T: 2°C. Assay description: For the assay 50 nl of a 100 fold concentrated solution of the test compound in DMSO was pipetted into a black low volume 384 well microtiter plate (...
Ligand InfoPC cidPC sid
In DepthDetails US Patent
TargetCyclin-dependent kinase 2/G1/S-specific cyclin-E1(Homo sapiens (Human))
Bayer Intellectual Property
US Patent
LigandPNGBDBM168449(US9669034, 48 (rac)-[(3-{[4-(4-fluoro-2-methoxyphe...)
Affinity DataIC50:  630nMpH: 8.0 T: 2°C. Assay description: For the assay 50 nl of a 100 fold concentrated solution of the test compound in DMSO was pipetted into a black low volume 384 well microtiter plate (...
Ligand InfoPC cidPC sid
In DepthDetails US Patent
TargetCyclin-dependent kinase 2/G1/S-specific cyclin-E1(Homo sapiens (Human))
Bayer Intellectual Property
US Patent
LigandPNGBDBM168449(US9669034, 48 (rac)-[(3-{[4-(4-fluoro-2-methoxyphe...)
Affinity DataIC50:  430nMpH: 8.0 T: 2°C. Assay description: For the assay 50 nl of a 100 fold concentrated solution of the test compound in DMSO was pipetted into a black low volume 384 well microtiter plate (...
Ligand InfoPC cidPC sid
In DepthDetails US Patent
TargetCyclin-dependent kinase 2/G1/S-specific cyclin-E1(Homo sapiens (Human))
Bayer Intellectual Property
US Patent
LigandPNGBDBM168449(US9669034, 48 (rac)-[(3-{[4-(4-fluoro-2-methoxyphe...)
Affinity DataIC50:  650nMpH: 8.0 T: 2°C. Assay description: For the assay 50 nl of a 100 fold concentrated solution of the test compound in DMSO was pipetted into a black low volume 384 well microtiter plate (...
Ligand InfoPC cidPC sid
In DepthDetails US Patent
TargetCyclin-T1/Cyclin-dependent kinase 9(Homo sapiens (Human))
Bayer Intellectual Property
US Patent
LigandPNGBDBM168449(US9669034, 48 (rac)-[(3-{[4-(4-fluoro-2-methoxyphe...)
Affinity DataIC50:  7nMpH: 8.0 T: 2°C. Assay description: For the assay 50 nl of a 100 fold concentrated solution of the test compound in DMSO was pipetted into a black low volume 384 well microtiter plate (...
Ligand InfoPC cidPC sid
In DepthDetails US Patent
TargetCyclin-T1/Cyclin-dependent kinase 9(Homo sapiens (Human))
Bayer Intellectual Property
US Patent
LigandPNGBDBM168449(US9669034, 48 (rac)-[(3-{[4-(4-fluoro-2-methoxyphe...)
Affinity DataIC50:  7nMpH: 8.0 T: 2°C. Assay description: For the assay 50 nl of a 100 fold concentrated solution of the test compound in DMSO was pipetted into a black low volume 384 well microtiter plate (...
Ligand InfoPC cidPC sid
In DepthDetails US Patent