BDBM16922 6-{5-[(2S)-2-amino-3-(1H-indol-3-yl)propoxy]pyridin-3-yl}-2,3-dihydro-1H-indol-2-one::oxindole pyridine, 9d
SMILES N[C@H](COc1cncc(c1)-c1ccc2CC(=O)Nc2c1)Cc1c[nH]c2ccccc12
InChI Key InChIKey=OADUJAQJQBQZRA-IBGZPJMESA-N
Data  1 IC50
  Tab Delimited (TSV)   2D SDfile   Computed 3D by Vconf -m prep SDfile
Find this compound or compounds like it in BindingDB:
Activity Spreadsheet -- Enzyme Inhibition Constant Data from BindingDB
Found 1 hit for monomerid = 16922
LigandPNGBDBM16922(6-{5-[(2S)-2-amino-3-(1H-indol-3-yl)propoxy]pyridi...)
Affinity DataIC50:  4.40E+3nMpH: 7.5 T: 2°C. Assay description: The kinase assay uses His-Akt1 and a biotinylated peptide as substrate. The biotinylated peptides were immobilized on streptavidin-coated FLASH plat...
In DepthDetails ArticlePubMed