BDBM16960 6-{5-[(2S)-2-amino-3-(1H-indol-3-yl)propoxy]-6-chloropyridin-3-yl}isoquinoline::Isoquinoline-pyridine, 10g
SMILES N[C@H](COc1cc(cnc1Cl)-c1ccc2cnccc2c1)Cc1c[nH]c2ccccc12
InChI Key InChIKey=BPJNKHOQHGDQRN-NRFANRHFSA-N
Data  2 IC50
  Tab Delimited (TSV)   2D SDfile   Computed 3D by Vconf -m prep SDfile
Find this compound or compounds like it in BindingDB:
Activity Spreadsheet -- Enzyme Inhibition Constant Data from BindingDB
Found 2 hits for monomerid = 16960
TargetRAC-alpha serine/threonine-protein kinase(Homo sapiens (Human))
Zhejiang University
Curated by ChEMBL
LigandPNGBDBM16960(6-{5-[(2S)-2-amino-3-(1H-indol-3-yl)propoxy]-6-chl...)
Affinity DataIC50:  12nM. Assay description: Inhibition of Akt
In DepthDetails ArticlePubMed
LigandPNGBDBM16960(6-{5-[(2S)-2-amino-3-(1H-indol-3-yl)propoxy]-6-chl...)
Affinity DataIC50:  12nMpH: 7.5 T: 2°C. Assay description: The kinase assay uses His-Akt1 and a biotinylated peptide as substrate. The biotinylated peptides were immobilized on streptavidin-coated FLASH plat...
In DepthDetails ArticlePubMed