BDBM17136 3-chloro-N-{4-chloro-2-[(5-chloropyridin-2-yl)carbamoyl]-6-methoxyphenyl}-4-{[2-(ethylamino)-1H-imidazol-1-yl]methyl}thiophene-2-carboxamide::Thiophene-Anthranilamide, 17n
SMILES CCNc1nccn1Cc1csc(C(=O)Nc2c(OC)cc(Cl)cc2C(=O)Nc2ccc(Cl)cn2)c1Cl
InChI Key InChIKey=MMBDVBGJNUJKOG-UHFFFAOYSA-N
Data  2 KI
  Tab Delimited (TSV)   2D SDfile   Computed 3D by Vconf -m prep SDfile
Find this compound or compounds like it in BindingDB:
Activity Spreadsheet -- Enzyme Inhibition Constant Data from BindingDB
Found 2 hits for monomerid = 17136
TargetCoagulation factor X(Homo sapiens (Human))
Berlex Biosciences
LigandPNGBDBM17136(3-chloro-N-{4-chloro-2-[(5-chloropyridin-2-yl)carb...)
Affinity DataKi:  0.00500nM. Assay description: The enzyme activities were determined kinetically as the initial rate of cleavage of a peptide p-nitroanilide. Km for enzyme and substrate was determ...
In DepthDetails ArticlePubMed
TargetProthrombin(Homo sapiens (Human))
Berlex Biosciences
LigandPNGBDBM17136(3-chloro-N-{4-chloro-2-[(5-chloropyridin-2-yl)carb...)
Affinity DataKi:  1.10E+3nM. Assay description: The enzyme activities were determined kinetically as the initial rate of cleavage of a peptide p-nitroanilide. Km for enzyme and substrate was determ...
In DepthDetails ArticlePubMed