BDBM17184 3-(4-{[3-(4-{[(2-methylphenyl)carbamoyl]amino}phenyl)-1H-pyrazol-1-yl]methyl}phenyl)propanoic acid::C-ring heterocyclic urea, 1
SMILES Cc1ccccc1NC(=O)Nc1ccc(cc1)-c1ccn(Cc2ccc(CCC(O)=O)cc2)n1
InChI Key InChIKey=SNUVKRNTJYMXOK-UHFFFAOYSA-N
Data  1 KI
  Tab Delimited (TSV)   2D SDfile   Computed 3D by Vconf -m prep SDfile
Find this compound or compounds like it in BindingDB:
Activity Spreadsheet -- Enzyme Inhibition Constant Data from BindingDB
Found 1 hit for monomerid = 17184
TargetIntegrin alpha-4/beta-1 [T112H](Homo sapiens (Human))
Glaxosmithkline
LigandPNGBDBM17184(3-(4-{[3-(4-{[(2-methylphenyl)carbamoyl]amino}phen...)
Affinity DataKi:  251nM ΔG°:  -8.91kcal/molepH: 7.5 T: 2°C. Assay description: J6 cells (1 million cells/well) were allowed to coat wheat germ agglutinin coated SPA beads (Amersham, 1 mg/well) in assay buffer. Tritiated 3H Stand...
In DepthDetails ArticlePubMed