BDBM17214 2,6-quinolinyl derivative, 36::3-[2-(2,6-dichlorophenyl)quinolin-6-yl]-2-[(2,6-dimethylphenyl)formamido]propanoic acid
SMILES Cc1cccc(C)c1C(=O)NC(Cc1ccc2nc(ccc2c1)-c1c(Cl)cccc1Cl)C(O)=O
InChI Key InChIKey=DNZAOTJAYGFQRS-UHFFFAOYSA-N
Data  1 IC50
  Tab Delimited (TSV)   2D SDfile   Computed 3D by Vconf -m prep SDfile
Find this compound or compounds like it in BindingDB:
Activity Spreadsheet -- Enzyme Inhibition Constant Data from BindingDB
Found 1 hit for monomerid = 17214
TargetIntegrin alpha-4/beta-1 [T112H](Homo sapiens (Human))
Ucb Pharma
LigandPNGBDBM17214(2,6-quinolinyl derivative, 36 | 3-[2-(2,6-dichloro...)
Affinity DataIC50:  37.2nMpH: 7.4 T: 2°C. Assay description: The VLA-4 expressing U937 cells were plated in 96-well microtiter plates, precoated with soluble human recombinant VCAM-1, in the presence of test co...
In DepthDetails ArticlePubMed