BDBM17260 3-chloro-N-{4-chloro-2-[(4-chlorophenyl)carbamoyl]phenyl}-4-({[3-(1H-imidazol-1-yl)propyl]amino}methyl)thiophene-2-carboxamide::thiophene-containing non-amidine inhibitor, 62
SMILES Clc1c(CNCCCn2ccnc2)csc1C(=O)Nc1ccc(Cl)cc1C(=O)Nc1ccc(Cl)cc1
InChI Key InChIKey=SGUFDEKHCMVEHV-UHFFFAOYSA-N
Data  3 KI
  Tab Delimited (TSV)   2D SDfile   Computed 3D by Vconf -m prep SDfile
Find this compound or compounds like it in BindingDB:
Activity Spreadsheet -- Enzyme Inhibition Constant Data from BindingDB
Found 3 hits for monomerid = 17260
TargetCoagulation factor X(Homo sapiens (Human))
Berlex
LigandPNGBDBM17260(3-chloro-N-{4-chloro-2-[(4-chlorophenyl)carbamoyl]...)
Affinity DataKi:  4.60nM. Assay description: The enzyme activities were determined kinetically as the initial rate of cleavage of a peptide p-nitroanilide. Km for enzyme and substrate was determ...
In DepthDetails ArticlePubMed
TargetProthrombin(Homo sapiens (Human))
Berlex
LigandPNGBDBM17260(3-chloro-N-{4-chloro-2-[(4-chlorophenyl)carbamoyl]...)
Affinity DataKi:  1.80E+3nM. Assay description: The enzyme activities were determined kinetically as the initial rate of cleavage of a peptide p-nitroanilide. Km for enzyme and substrate was determ...
In DepthDetails ArticlePubMed
TargetSerine protease 1(Bos taurus (bovine))
Berlex
LigandPNGBDBM17260(3-chloro-N-{4-chloro-2-[(4-chlorophenyl)carbamoyl]...)
Affinity DataKi: >5.00E+3nM. Assay description: The enzyme activities were determined kinetically as the initial rate of cleavage of a peptide p-nitroanilide. Km for enzyme and substrate was determ...
In DepthDetails ArticlePubMed