BDBM1727 (4R,5S,6S,7R)-4,7-dibenzyl-5,6-dihydroxy-1,3-bis[(4-hydroxyphenyl)methyl]-1,3-diazepan-2-one::CHEMBL35860::Cyclic Urea deriv. 9s
SMILES O[C@@H]1[C@@H](O)[C@@H](Cc2ccccc2)N(Cc2ccc(O)cc2)C(=O)N(Cc2ccc(O)cc2)[C@@H]1Cc1ccccc1
InChI Key InChIKey=YCDGAESMEYQMIE-ZRTHHSRSSA-N
Data  2 KI
  Tab Delimited (TSV)   2D SDfile   Computed 3D by Vconf -m prep SDfile
Find this compound or compounds like it in BindingDB:
Activity Spreadsheet -- Enzyme Inhibition Constant Data from BindingDB
Found 2 hits for monomerid = 1727
TargetGag-Pol polyprotein [489-587](Human immunodeficiency virus type 1)
Lindsley F. Kimball Research Institute
Curated by ChEMBL
LigandPNGBDBM1727((4R,5S,6S,7R)-4,7-dibenzyl-5,6-dihydroxy-1,3-bis[(...)
Affinity DataKi:  0.120nM. Assay description: Inhibition of HIV-1 protease
In DepthDetails ArticlePubMed
TargetDimer of Gag-Pol polyprotein [489-587](Human immunodeficiency virus type 1)
Dupont Pharmaceuticals
LigandPNGBDBM1727((4R,5S,6S,7R)-4,7-dibenzyl-5,6-dihydroxy-1,3-bis[(...)
Affinity DataKi:  0.120nM. Assay description: Inhibition of HIV protease was measured by assay of the cleavage of a fluorescent peptide substrate. The fluorescent product (2-aminobenzoyl-Ala-Thr-...
In DepthDetails ArticlePubMed