BDBM17293 Compound 10::MB-329-131A2::[5-(6-amino-9H-purin-9-yl)-3,4-dihydroxyoxolan-2-yl]methyl nonanoate
SMILES CCCCCCCCC(=O)OCC1OC(C(O)C1O)n1cnc2c(N)ncnc12
InChI Key InChIKey=HTBGORAUJWANQC-UHFFFAOYSA-N
Data  1 KI
  Tab Delimited (TSV)   2D SDfile   Computed 3D by Vconf -m prep SDfile
Find this compound or compounds like it in BindingDB:
Activity Spreadsheet -- Enzyme Inhibition Constant Data from BindingDB
Found 1 hit for monomerid = 17293
Target17-beta-hydroxysteroid dehydrogenase type 1(Homo sapiens (Human))
Chul
LigandPNGBDBM17293(Compound 10 | MB-329-131A2 | [5-(6-amino-9H-purin-...)
Affinity DataKi:  2.50E+5nM ΔG°:  -5.11kcal/molepH: 7.5 T: 2°C. Assay description: For steady-state kinetic study of hybrid inhibitors, a Fluorolog 3 instrument was used to monitor the fluorescent signal of NADPH formed during estra...
In DepthDetails ArticlePubMed