BDBM11144 (1S,2S)-1-(dimethylcarbamoyl)-3-[(3S)-3-fluoropyrrolidin-1-yl]-3-oxo-1-(4-{[1,2,4]triazolo[1,5-a]pyridin-6-yl}phenyl)propan-2-aminium; 2,2,2-trifluoroacetate::(2S,3S)-4-(dimethylamino)-1-[(3S)-3-fluoropyrrolidin-1-yl]-1,4-dioxo-3-(4-[1,2,4]triazolo[1,5-a]pyridin-6-ylphenyl)butan-2-aminium trifluoroacetate::Biarylphenylalanine (S)-Fluoropyrrolidide Amide 23::phenylalanine derived inhibitor, 5
SMILES CN(C)C(=O)[C@H]([C@H]([NH3+])C(=O)N1CC[C@H](F)C1)c1ccc(cc1)-c1ccc2ncnn2c1
InChI Key InChIKey=ZNHVIJAGMFQGMS-IHPCNDPISA-O
Data  8 IC50
  Tab Delimited (TSV)   2D SDfile   Computed 3D by Vconf -m prep SDfile
Find this compound or compounds like it in BindingDB:
Activity Spreadsheet -- Enzyme Inhibition Constant Data from BindingDB
Found 8 hits for monomerid = 11144
TargetDipeptidyl peptidase 4(Homo sapiens (Human))
Merck Research Laboratories
LigandPNGBDBM11144((1S,2S)-1-(dimethylcarbamoyl)-3-[(3S)-3-fluoropyrr...)
Affinity DataIC50:  4.30nMpH: 7.5 T: 2°C. Assay description: The enzyme activity resulted in the formation of the fluorescent product amidomethylcoumarin (AMC), which was monitored by excitation at 360 nm and m...
In DepthDetails ArticlePubMed
TargetDipeptidyl peptidase 2(Homo sapiens (Human))
Merck Research Laboratories
LigandPNGBDBM11144((1S,2S)-1-(dimethylcarbamoyl)-3-[(3S)-3-fluoropyrr...)
Affinity DataIC50: >1.00E+5nM. Assay description: The enzyme activity resulted in the formation of the fluorescent product amidomethylcoumarin (AMC), which was monitored by excitation at 360 nm and m...
In DepthDetails ArticlePubMed
TargetDipeptidyl peptidase 8(Homo sapiens (Human))
Merck Research Laboratories
LigandPNGBDBM11144((1S,2S)-1-(dimethylcarbamoyl)-3-[(3S)-3-fluoropyrr...)
Affinity DataIC50: >1.00E+5nM. Assay description: The enzyme activity resulted in the formation of the fluorescent product amidomethylcoumarin (AMC), which was monitored by excitation at 360 nm and m...
In DepthDetails ArticlePubMed
TargetDipeptidyl peptidase 9(Homo sapiens (Human))
Merck Research Laboratories
LigandPNGBDBM11144((1S,2S)-1-(dimethylcarbamoyl)-3-[(3S)-3-fluoropyrr...)
Affinity DataIC50: >1.00E+5nM. Assay description: The enzyme activity resulted in the formation of the fluorescent product amidomethylcoumarin (AMC), which was monitored by excitation at 360 nm and m...
In DepthDetails ArticlePubMed
TargetDipeptidyl peptidase 4(Homo sapiens (Human))
Merck Research Laboratories
LigandPNGBDBM11144((1S,2S)-1-(dimethylcarbamoyl)-3-[(3S)-3-fluoropyrr...)
Affinity DataIC50:  4nMpH: 7.5 T: 2°C. Assay description: The enzyme activity resulted in the formation of the fluorescent product amidomethylcoumarin (AMC), which was monitored by excitation at 360 nm and m...
In DepthDetails ArticlePubMed
TargetDipeptidyl peptidase 2(Homo sapiens (Human))
Merck Research Laboratories
LigandPNGBDBM11144((1S,2S)-1-(dimethylcarbamoyl)-3-[(3S)-3-fluoropyrr...)
Affinity DataIC50: >1.00E+5nM. Assay description: The enzyme activity resulted in the formation of the fluorescent product amidomethylcoumarin (AMC), which was monitored by excitation at 360 nm and m...
In DepthDetails ArticlePubMed
TargetDipeptidyl peptidase 8(Homo sapiens (Human))
Merck Research Laboratories
LigandPNGBDBM11144((1S,2S)-1-(dimethylcarbamoyl)-3-[(3S)-3-fluoropyrr...)
Affinity DataIC50: >1.00E+5nM. Assay description: The enzyme activity resulted in the formation of the fluorescent product, which was monitored by excitation at 400 nm and measurement of fluorescent ...
In DepthDetails ArticlePubMed
TargetDipeptidyl peptidase 9(Homo sapiens (Human))
Merck Research Laboratories
LigandPNGBDBM11144((1S,2S)-1-(dimethylcarbamoyl)-3-[(3S)-3-fluoropyrr...)
Affinity DataIC50: >1.00E+5nM. Assay description: The enzyme activity resulted in the formation of the fluorescent product amidomethylcoumarin (AMC), which was monitored by excitation at 360 nm and m...
In DepthDetails ArticlePubMed