BDBM17390 1,2,4-Triazole Compound, 48::5-{[(2-fluorophenyl)methyl]sulfanyl}-N-(4-methoxyphenyl)-4H-1,2,4-triazol-3-amine
SMILES COc1ccc(Nc2nnc(SCc3ccccc3F)[nH]2)cc1
InChI Key InChIKey=UBZUXVQIHHRQHG-UHFFFAOYSA-N
Data  1 KI
  Tab Delimited (TSV)   2D SDfile   Computed 3D by Vconf -m prep SDfile
Find this compound or compounds like it in BindingDB:
Activity Spreadsheet -- Enzyme Inhibition Constant Data from BindingDB
Found 1 hit for monomerid = 17390
TargetMethionine aminopeptidase 2(Homo sapiens (Human))
Gsk
LigandPNGBDBM17390(1,2,4-Triazole Compound, 48 | 5-{[(2-fluorophenyl)...)
Affinity DataKi:  0.130nM. Assay description: MetAP2 activity was monitored by measuring the initial velocity of turnover of the artificial substrate Met-AMC. Assays were performed in 96-well mi...
In DepthDetails ArticlePubMed