BDBM175402 1,3-Dimethyl-8-[{3-(2-(imidazol-1-yl)-2-oxoethoxy)-4-methoxy}-phenyl]xanthine (16h, RB-450)
SMILES COc1ccc(cc1OCC(=O)N1CCN=C1)-c1nc2n(C)c(=O)n(C)c(=O)c2[nH]1
InChI Key InChIKey=UFDSXJSHQYVRHF-UHFFFAOYSA-N
Data  4 KI
  Tab Delimited (TSV)   2D SDfile   Computed 3D by Vconf -m prep SDfile
Find this compound or compounds like it in BindingDB:
Activity Spreadsheet -- Enzyme Inhibition Constant Data from BindingDB
Found 4 hits for monomerid = 175402
TargetAdenosine receptor A2a(Homo sapiens (Human))
Panjab University
LigandPNGBDBM175402(1,3-Dimethyl-8-[{3-(2-(imidazol-1-yl)-2-oxoethoxy)...)
Affinity DataKi:  1.12E+3nM. Assay description: Dissociation constants at A1, A2A and A3 receptors (Ki-values) were determined in radioligand competition experiments as reported earlier [19,20]. Al...
In DepthDetails ArticlePubMed
TargetAdenosine receptor A3 [I248L](Homo sapiens (Human))
Panjab University
LigandPNGBDBM175402(1,3-Dimethyl-8-[{3-(2-(imidazol-1-yl)-2-oxoethoxy)...)
Affinity DataKi:  4.10E+3nM. Assay description: Dissociation constants at A1, A2A and A3 receptors (Ki-values) were determined in radioligand competition experiments as reported earlier [19,20]. Al...
In DepthDetails ArticlePubMed
TargetAdenosine receptor A2b(Homo sapiens (Human))
Panjab University
LigandPNGBDBM175402(1,3-Dimethyl-8-[{3-(2-(imidazol-1-yl)-2-oxoethoxy)...)
Affinity DataKi: >3.00E+4nM. Assay description: Dissociation constants at A1, A2A and A3 receptors (Ki-values) were determined in radioligand competition experiments as reported earlier [19,20]. Al...
In DepthDetails ArticlePubMed
TargetAdenosine receptor A1(Homo sapiens (Human))
Panjab University
LigandPNGBDBM175402(1,3-Dimethyl-8-[{3-(2-(imidazol-1-yl)-2-oxoethoxy)...)
Affinity DataKi: >3.00E+4nM. Assay description: Dissociation constants at A1, A2A and A3 receptors (Ki-values) were determined in radioligand competition experiments as reported earlier [19,20]. Al...
In DepthDetails ArticlePubMed