BDBM176527 US9120752, 61::US9765029, 61
SMILES C[C@H](NC(=O)c1cccc(n1)-c1ccc(Oc2ccc(cn2)C(F)(F)F)cc1)C(N)=O
InChI Key InChIKey=VQSOGOHFWKDUMT-LBPRGKRZSA-N
Data  2 IC50
  Tab Delimited (TSV)   2D SDfile   Computed 3D by Vconf -m prep SDfile
Find this compound or compounds like it in BindingDB:
Activity Spreadsheet -- Enzyme Inhibition Constant Data from BindingDB
Found 2 hits for monomerid = 176527
TargetSodium channel protein type 9 subunit alpha(Homo sapiens (Human))
Purdue Pharma
US Patent
LigandPNGBDBM176527(US9120752, 61 | US9765029, 61)
Affinity DataIC50:  4.34E+3nM. Assay description: The assay buffer was formulated by removing 120 mL from a 1 L bottle of fresh, sterile dH2O (Mediatech, Herndon, Va.) and adding 100 mL of 10×HBSS th...
Ligand InfoPC cidPC sid
In DepthDetails US Patent
TargetSodium channel protein type 9 subunit alpha(Homo sapiens (Human))
Purdue Pharma
US Patent
LigandPNGBDBM176527(US9120752, 61 | US9765029, 61)
Affinity DataIC50:  4.34E+3nMT: 2°C. Assay description: Cells were prepared by plating the recombinant HEK293 cells or other host cells expressing either recombinant or non-recombinant, native, Nav1.7 alph...
Ligand InfoPC cidPC sid
In DepthDetails US Patent