BDBM176785 US9675612, 28 7-[(5-Methoxy-2-oxo-2,3-dihydro-1,3-benzothiazol-6-yl)amino]-N,N-dimethyl[1,3]thiazolo[5,4-d]pyrimidine-2-carboxamide
SMILES COc1cc2[nH]c(=O)sc2cc1Nc1ncnc2sc(nc12)C(=O)N(C)C
InChI Key InChIKey=WHXOJFLHDLEWEL-UHFFFAOYSA-N
Data  1 IC50
  Tab Delimited (TSV)   2D SDfile   Computed 3D by Vconf -m prep SDfile
Find this compound or compounds like it in BindingDB:
Activity Spreadsheet -- Enzyme Inhibition Constant Data from BindingDB
Found 1 hit for monomerid = 176785
TargetIsoform 2 of MAP kinase-interacting serine/threonine-protein kinase 1 (MNK1a) 344D](Homo sapiens (Human))
Bayer Pharma Aktiengesellschaft
US Patent
LigandPNGBDBM176785(US9675612, 28 7-[(5-Methoxy-2-oxo-2,3-dihydro-1,3-...)
Affinity DataIC50:  1.08E+3nMpH: 7.5Assay Description:For the assay 50 nL of a 100 fold concentrated solution of the test compound in DMSO was pipetted into a black low volume 384 well microtiter plate (...
Ligand InfoPC cidPC sid
In DepthDetails US Patent