BDBM17857 3,5-Pyrazolediamine Inhibitor, 7::4-[(E)-2-(4-fluorophenyl)diazen-1-yl]-3-imino-3H-pyrazol-5-amine
SMILES Fc1ccc(NN=c2c(=N)nnc2=N)cc1
InChI Key InChIKey=XCDRRKZJZOYQRS-UHFFFAOYSA-N
Data  1 IC50
PDB links: 1 PDB ID matches this monomer.
  Tab Delimited (TSV)   2D SDfile   Computed 3D by Vconf -m prep SDfile
Find this compound or compounds like it in BindingDB:
Activity Spreadsheet -- Enzyme Inhibition Constant Data from BindingDB
Found 1 hit for monomerid = 17857
TargetMethionine aminopeptidase(Escherichia coli (strain K12))
The Procter & Gamble Pharmaceuticals
LigandPNGBDBM17857(3,5-Pyrazolediamine Inhibitor, 7 | 4-[(E)-2-(4-flu...)
Affinity DataIC50:  580nMpH: 7.5 T: 2°C. Assay description: The inhibitory activity of a compound toward EcMAP was measured by incubating the compound at various concentrations in the presence of the enzyme an...