BDBM181070 (E)-4-(2-Oxo-2H-chromen-3-yl)-N'-(4-(trifluoromethyl)benzylidene)thiazole-2-carbohydrazide (7o)
SMILES FC(F)(F)c1ccc(\C=N\NC(=O)c2nc(cs2)-c2cc3ccccc3oc2=O)cc1
InChI Key InChIKey=ZCZCZBWXHJKURR-KIBLKLHPSA-N
Data  2 IC50
  Tab Delimited (TSV)   2D SDfile   Computed 3D by Vconf -m prep SDfile
Find this compound or compounds like it in BindingDB:
Activity Spreadsheet -- Enzyme Inhibition Constant Data from BindingDB
Found 2 hits for monomerid = 181070
TargetProbable maltase-glucoamylase 2(Homo sapiens)
Babasaheb Bhimrao Ambedkar University (A Central University)
Curated by ChEMBL
LigandPNGBDBM181070((E)-4-(2-Oxo-2H-chromen-3-yl)-N'-(4-(trifluoro...)
Affinity DataIC50:  6.20E+3nM. Assay description: Inhibition of alpha-glucosidase (unknown origin) using p-nitro phenyl glucopyranoside as substrate preincubated for 10 mins followed by substrate add...
In DepthDetails ArticlePubMed
TargetAlpha-glucosidase MAL12(Saccharomyces cerevisiae)
Jishou University
LigandPNGBDBM181070((E)-4-(2-Oxo-2H-chromen-3-yl)-N'-(4-(trifluoro...)
Affinity DataIC50:  1.60E+4nMpH: 6.8Assay Description:The test compounds were dissolved in DMSO to prepare the required distributing concentration. α-Glucosidase inhibitory activity was assayed by u...
In DepthDetails ArticlePubMed