BDBM18130 (2S)-2-[(2S)-2-amino-3-(4-hydroxyphenyl)propanamido]-2-[(2S,3S,4S,5S)-1,3,4,5-tetrahydroxy-4-(hydroxymethyl)piperidin-2-yl]acetic acid::SB-239629
SMILES [H][C@]1([C@H](NC(=O)[C@@H](N)Cc2ccc(O)cc2)C(O)=O)[C@H](O)[C@](O)(CO)[C@@H](O)CN1O
InChI Key InChIKey=YNVYTCBBBGXDHW-NCBDHNCWSA-N
Data  1 IC50
PDB links: 1 PDB ID matches this monomer.
  Tab Delimited (TSV)   2D SDfile   Computed 3D by Vconf -m prep SDfile
Find this compound or compounds like it in BindingDB:
Activity Spreadsheet -- Enzyme Inhibition Constant Data from BindingDB
Found 1 hit for monomerid = 18130
TargetTyrosine--tRNA ligase(Staphylococcus aureus)
Gsk
LigandPNGBDBM18130((2S)-2-[(2S)-2-amino-3-(4-hydroxyphenyl)propanamid...)
Affinity DataIC50:  3nMpH: 7.9 T: 2°C. Assay description: The concentration of inhibitor which results in 50% inhibition (IC50) of enzyme activity was determined by preincubating recombinant S. aureus TyrRS ...