BDBM18181 4-[(1S,7S,7aR)-7-hydroxy-3-oxo-1-(trifluoromethyl)-hexahydro-1H-pyrrolo[1,2-a]imidazolidin-2-yl]-2-chloro-3-methylbenzonitrile::imidazolin-2-one, 12b
SMILES [H][C@@]12[C@@H](O)CCN1C(=O)N([C@@H]2C(F)(F)F)c1ccc(C#N)c(Cl)c1C
InChI Key InChIKey=XMBLXQQNSLMANW-DRZSPHRISA-N
Data  1 KI  1 EC50
  Tab Delimited (TSV)   2D SDfile   Computed 3D by Vconf -m prep SDfile
Find this compound or compounds like it in BindingDB:
Activity Spreadsheet -- Enzyme Inhibition Constant Data from BindingDB
Found 1 hit for monomerid = 18181
TargetAndrogen receptor(Homo sapiens (Human))
Bristol-Myers Squibb Pharmaceutical Research Institute
LigandPNGBDBM18181(4-[(1S,7S,7aR)-7-hydroxy-3-oxo-1-(trifluoromethyl)...)
Affinity DataKi:  1.90nM ΔG°:  -11.8kcal/mole EC50:  48nMpH: 7.4 T: 2°C. Assay description: Receptor Binding Assay (Ki)-Binding determined through direct displacement of ligand with [3H]-DHT in the MDA-453 cell line. Transactivation Assay (E...
In DepthDetails ArticlePubMed