BDBM182717 US9145402, 24
SMILES CNc1nc(Nc2ccc(cc2OC)N2CCOCC2)ncc1Cl
InChI Key InChIKey=LZNKQRLLXOCSJT-UHFFFAOYSA-N
Data  1 KI
  Tab Delimited (TSV)   2D SDfile   Computed 3D by Vconf -m prep SDfile
Find this compound or compounds like it in BindingDB:
Activity Spreadsheet -- Enzyme Inhibition Constant Data from BindingDB
Found 1 hit for monomerid = 182717
TargetLeucine-rich repeat serine/threonine-protein kinase 2(Homo sapiens (Human))
Genentech
US Patent
LigandPNGBDBM182717(US9145402, 24)
Affinity DataKi:  9nM. Assay description: his assay was used to determine a compound's potency in inhibiting activity of LRRK2 by determining, Kiapp, IC50, or percent inhibition values. In 38...
In DepthDetails US Patent