BDBM185042 US9156811, DDD99833
SMILES CN(c1c(C)nn(C)c1C)[S+]([O-])(=O)c1c(Cl)cc(CCCCCCn2ccnc2)cc1Cl
InChI Key InChIKey=KFZNUMAAQRKTIR-UHFFFAOYSA-N
Data  3 IC50
  Tab Delimited (TSV)   2D SDfile   Computed 3D by Vconf -m prep SDfile
Find this compound or compounds like it in BindingDB:
Activity Spreadsheet -- Enzyme Inhibition Constant Data from BindingDB
Found 3 hits for monomerid = 185042
TargetGlycylpeptide N-tetradecanoyltransferase(Trypanosoma brucei)
Univeristy Of Dundee
US Patent
LigandPNGBDBM185042(US9156811, DDD99833)
Affinity DataIC50:  3nMpH: 7.4 T: 2°C. Assay description: Measurement of the ability of compounds to inhibit the NMT-1 and/or NMT-2 enzyme isoforms of human, trypanosome (T. brucei), leishmanial (L. major) a...
In DepthDetails US Patent
TargetGlycylpeptide N-tetradecanoyltransferase(Leishmania major)
Univeristy Of Dundee
US Patent
LigandPNGBDBM185042(US9156811, DDD99833)
Affinity DataIC50:  9nMpH: 7.4 T: 2°C. Assay description: Measurement of the ability of compounds to inhibit the NMT-1 and/or NMT-2 enzyme isoforms of human, trypanosome (T. brucei), leishmanial (L. major) a...
In DepthDetails US Patent
TargetGlycylpeptide N-tetradecanoyltransferase 1(Homo sapiens (Human))
Univeristy Of Dundee
US Patent
LigandPNGBDBM185042(US9156811, DDD99833)
Affinity DataIC50:  168nMpH: 7.4 T: 2°C. Assay description: Measurement of the ability of compounds to inhibit the NMT-1 and/or NMT-2 enzyme isoforms of human, trypanosome (T. brucei), leishmanial (L. major) a...
In DepthDetails US Patent