BDBM18530 6-(diethylamino)-4-(trifluoromethyl)-1,2-dihydroquinolin-2-one::6-dialkylamino-4-trifluoromethylquinolin-2(1H)-one, 4d
SMILES CCN(CC)c1ccc2[nH]c(=O)cc(c2c1)C(F)(F)F
InChI Key InChIKey=GYBBTRBXNXRHPO-UHFFFAOYSA-N
Data  1 KI  1 EC50
  Tab Delimited (TSV)   2D SDfile   Computed 3D by Vconf -m prep SDfile
Find this compound or compounds like it in BindingDB:
Activity Spreadsheet -- Enzyme Inhibition Constant Data from BindingDB
Found 1 hit for monomerid = 18530
TargetAndrogen receptor(Homo sapiens (Human))
Ligand Pharmaceuticals
LigandPNGBDBM18530(6-(diethylamino)-4-(trifluoromethyl)-1,2-dihydroqu...)
Affinity DataKi:  4.40nM ΔG°:  -11.9kcal/mole EC50:  2.10nMpH: 7.4 T: 2°C. Assay description: The compounds were evaluated in a transcriptional activation assay with hAR in a mammalian cell background (CV-1) as the primary in vitro assay. Rece...
In DepthDetails ArticlePubMed